navit-project.org
http://forum.navit-project.org/

cmake failed
http://forum.navit-project.org/viewtopic.php?f=19&t=738
Page 1 of 1

Author:  Buzz lightzyear [ 15 Oct 2018, 08:46 ]
Post subject:  cmake failed

Hi@all,

I want to compile the navit 0.5.3 project on my Ubuntu 18.04 system. Unfortunately the "make"-command fails with this errormessage:

Code:
make[2]: Circular navit/icons/gui_map.svg <- navit/icons/gui_map.svg dependency dropped.
[ 26%] Generating gui_map.png
convert: unable to open image `#linearGradient4873': No such file or directory @ error/blob.c/OpenBlob/2701.
convert: no decode delegate for this image format `' @ error/constitute.c/ReadImage/504.
convert: unable to open image `#linearGradient4873': No such file or directory @ error/blob.c/OpenBlob/2701.
convert: no decode delegate for this image format `' @ error/constitute.c/ReadImage/504.
convert: unable to open image `#linearGradient4873': No such file or directory @ error/blob.c/OpenBlob/2701.
convert: no decode delegate for this image format `' @ error/constitute.c/ReadImage/504.
convert: unable to open image `#linearGradient4873': No such file or directory @ error/blob.c/OpenBlob/2701.
convert: no decode delegate for this image format `' @ error/constitute.c/ReadImage/504.
convert: unable to open image `#linearGradient4873': No such file or directory @ error/blob.c/OpenBlob/2701.
convert: no decode delegate for this image format `' @ error/constitute.c/ReadImage/504.
convert: unable to open image `#linearGradient4873': No such file or directory @ error/blob.c/OpenBlob/2701.
convert: no decode delegate for this image format `' @ error/constitute.c/ReadImage/504.
convert: unable to open image `#linearGradient4873': No such file or directory @ error/blob.c/OpenBlob/2701.
convert: no decode delegate for this image format `' @ error/constitute.c/ReadImage/504.
convert: unable to open image `#linearGradient4873': No such file or directory @ error/blob.c/OpenBlob/2701.
convert: no decode delegate for this image format `' @ error/constitute.c/ReadImage/504.
convert: unable to open image `#linearGradient4873': No such file or directory @ error/blob.c/OpenBlob/2701.
convert: no decode delegate for this image format `' @ error/constitute.c/ReadImage/504.
convert: unable to open image `#linearGradient4873': No such file or directory @ error/blob.c/OpenBlob/2701.
convert: no decode delegate for this image format `' @ error/constitute.c/ReadImage/504.
convert: unable to open image `#linearGradient4873': No such file or directory @ error/blob.c/OpenBlob/2701.
convert: no decode delegate for this image format `' @ error/constitute.c/ReadImage/504.
convert: unable to open image `#linearGradient4873': No such file or directory @ error/blob.c/OpenBlob/2701.
convert: no decode delegate for this image format `' @ error/constitute.c/ReadImage/504.
convert: unable to open image `#linearGradient4873': No such file or directory @ error/blob.c/OpenBlob/2701.
convert: no decode delegate for this image format `' @ error/constitute.c/ReadImage/504.
convert: unable to open image `#linearGradient4873': No such file or directory @ error/blob.c/OpenBlob/2701.
convert: no decode delegate for this image format `' @ error/constitute.c/ReadImage/504.
convert: unable to open image `#linearGradient4873': No such file or directory @ error/blob.c/OpenBlob/2701.
convert: no decode delegate for this image format `' @ error/constitute.c/ReadImage/504.
convert: unable to open image `#linearGradient4873': No such file or directory @ error/blob.c/OpenBlob/2701.
convert: no decode delegate for this image format `' @ error/constitute.c/ReadImage/504.
convert: unable to open image `#linearGradient4873': No such file or directory @ error/blob.c/OpenBlob/2701.
convert: no decode delegate for this image format `' @ error/constitute.c/ReadImage/504.
convert: unable to open image `#linearGradient4873': No such file or directory @ error/blob.c/OpenBlob/2701.
convert: no decode delegate for this image format `' @ error/constitute.c/ReadImage/504.
convert: unable to open image `#linearGradient4873': No such file or directory @ error/blob.c/OpenBlob/2701.
convert: no decode delegate for this image format `' @ error/constitute.c/ReadImage/504.
convert: unable to open image `#linearGradient4873': No such file or directory @ error/blob.c/OpenBlob/2701.
convert: no decode delegate for this image format `' @ error/constitute.c/ReadImage/504.
navit/icons/CMakeFiles/images.dir/build.make:3819: recipe for target 'navit/icons/gui_map.png' failed
make[2]: *** [navit/icons/gui_map.png] Error 1
make[2]: *** Deleting file 'navit/icons/gui_map.png'
CMakeFiles/Makefile2:1617: recipe for target 'navit/icons/CMakeFiles/images.dir/all' failed
make[1]: *** [navit/icons/CMakeFiles/images.dir/all] Error 2
Makefile:151: recipe for target 'all' failed
make: *** [all] Error 2


Google cannot help me in this case... can someone tell me whats the problem here?
Thx & YC
BL

Author:  Mapmapper [ 15 Oct 2018, 10:10 ]
Post subject:  Re: cmake failed

Are you sure that you have installed all libraries for navit?

Author:  Buzz lightzyear [ 15 Oct 2018, 15:14 ]
Post subject:  Re: cmake failed

yes, I think so... the ./configure-command works without problems...

Author:  Buzz lightzyear [ 15 Oct 2018, 16:42 ]
Post subject:  Re: cmake failed

Hey again...

ok, there was a dependency missing... O_O thx for the hint :-)

All Ubuntu-requirements can be found here:

https://wiki.navit-project.org/index.ph ... pendencies

Thx & YS
BL

Author:  Mapmapper [ 15 Oct 2018, 20:56 ]
Post subject:  Re: cmake failed

What I make:
1. Install navit from Ubuntu repositories global. So all libraries installed.
2. Download tar.gz und then only make, make install (only local installation)

Ah ok, I didnt see your answer.

Author:  Buzz lightzyear [ 16 Oct 2018, 17:05 ]
Post subject:  Re: cmake failed

There is only an old version in the Ubuntu repository.

Author:  Mapmapper [ 16 Oct 2018, 18:15 ]
Post subject:  Re: cmake failed

Yes, but I used it to install the libraries

Page 1 of 1 All times are UTC
Powered by phpBB © 2000, 2002, 2005, 2007 phpBB Group
http://www.phpbb.com/