navit-project.org

forum for navit navigation tool
It is currently 21 Nov 2018, 18:59
View unanswered posts | View active topics


All times are UTC


Forum rules


Feel free to ask anything here related to the development process - coding, creating new features, fixing bugs and custom changes of Navit.

Note: For reporting bugs, use the bug tracker.



Post new topic Reply to topic  [ 7 posts ] 
Author Message
 Post subject: cmake failed
PostPosted: 15 Oct 2018, 08:46 
Offline

Joined: 15 Oct 2018, 08:43
Posts: 4
Hi@all,

I want to compile the navit 0.5.3 project on my Ubuntu 18.04 system. Unfortunately the "make"-command fails with this errormessage:

Code:
make[2]: Circular navit/icons/gui_map.svg <- navit/icons/gui_map.svg dependency dropped.
[ 26%] Generating gui_map.png
convert: unable to open image `#linearGradient4873': No such file or directory @ error/blob.c/OpenBlob/2701.
convert: no decode delegate for this image format `' @ error/constitute.c/ReadImage/504.
convert: unable to open image `#linearGradient4873': No such file or directory @ error/blob.c/OpenBlob/2701.
convert: no decode delegate for this image format `' @ error/constitute.c/ReadImage/504.
convert: unable to open image `#linearGradient4873': No such file or directory @ error/blob.c/OpenBlob/2701.
convert: no decode delegate for this image format `' @ error/constitute.c/ReadImage/504.
convert: unable to open image `#linearGradient4873': No such file or directory @ error/blob.c/OpenBlob/2701.
convert: no decode delegate for this image format `' @ error/constitute.c/ReadImage/504.
convert: unable to open image `#linearGradient4873': No such file or directory @ error/blob.c/OpenBlob/2701.
convert: no decode delegate for this image format `' @ error/constitute.c/ReadImage/504.
convert: unable to open image `#linearGradient4873': No such file or directory @ error/blob.c/OpenBlob/2701.
convert: no decode delegate for this image format `' @ error/constitute.c/ReadImage/504.
convert: unable to open image `#linearGradient4873': No such file or directory @ error/blob.c/OpenBlob/2701.
convert: no decode delegate for this image format `' @ error/constitute.c/ReadImage/504.
convert: unable to open image `#linearGradient4873': No such file or directory @ error/blob.c/OpenBlob/2701.
convert: no decode delegate for this image format `' @ error/constitute.c/ReadImage/504.
convert: unable to open image `#linearGradient4873': No such file or directory @ error/blob.c/OpenBlob/2701.
convert: no decode delegate for this image format `' @ error/constitute.c/ReadImage/504.
convert: unable to open image `#linearGradient4873': No such file or directory @ error/blob.c/OpenBlob/2701.
convert: no decode delegate for this image format `' @ error/constitute.c/ReadImage/504.
convert: unable to open image `#linearGradient4873': No such file or directory @ error/blob.c/OpenBlob/2701.
convert: no decode delegate for this image format `' @ error/constitute.c/ReadImage/504.
convert: unable to open image `#linearGradient4873': No such file or directory @ error/blob.c/OpenBlob/2701.
convert: no decode delegate for this image format `' @ error/constitute.c/ReadImage/504.
convert: unable to open image `#linearGradient4873': No such file or directory @ error/blob.c/OpenBlob/2701.
convert: no decode delegate for this image format `' @ error/constitute.c/ReadImage/504.
convert: unable to open image `#linearGradient4873': No such file or directory @ error/blob.c/OpenBlob/2701.
convert: no decode delegate for this image format `' @ error/constitute.c/ReadImage/504.
convert: unable to open image `#linearGradient4873': No such file or directory @ error/blob.c/OpenBlob/2701.
convert: no decode delegate for this image format `' @ error/constitute.c/ReadImage/504.
convert: unable to open image `#linearGradient4873': No such file or directory @ error/blob.c/OpenBlob/2701.
convert: no decode delegate for this image format `' @ error/constitute.c/ReadImage/504.
convert: unable to open image `#linearGradient4873': No such file or directory @ error/blob.c/OpenBlob/2701.
convert: no decode delegate for this image format `' @ error/constitute.c/ReadImage/504.
convert: unable to open image `#linearGradient4873': No such file or directory @ error/blob.c/OpenBlob/2701.
convert: no decode delegate for this image format `' @ error/constitute.c/ReadImage/504.
convert: unable to open image `#linearGradient4873': No such file or directory @ error/blob.c/OpenBlob/2701.
convert: no decode delegate for this image format `' @ error/constitute.c/ReadImage/504.
convert: unable to open image `#linearGradient4873': No such file or directory @ error/blob.c/OpenBlob/2701.
convert: no decode delegate for this image format `' @ error/constitute.c/ReadImage/504.
navit/icons/CMakeFiles/images.dir/build.make:3819: recipe for target 'navit/icons/gui_map.png' failed
make[2]: *** [navit/icons/gui_map.png] Error 1
make[2]: *** Deleting file 'navit/icons/gui_map.png'
CMakeFiles/Makefile2:1617: recipe for target 'navit/icons/CMakeFiles/images.dir/all' failed
make[1]: *** [navit/icons/CMakeFiles/images.dir/all] Error 2
Makefile:151: recipe for target 'all' failed
make: *** [all] Error 2


Google cannot help me in this case... can someone tell me whats the problem here?
Thx & YC
BL


 Profile  
 
 Post subject: Re: cmake failed
PostPosted: 15 Oct 2018, 10:10 
Offline

Joined: 26 Sep 2013, 10:59
Posts: 74
Are you sure that you have installed all libraries for navit?


 Profile  
 
 Post subject: Re: cmake failed
PostPosted: 15 Oct 2018, 15:14 
Offline

Joined: 15 Oct 2018, 08:43
Posts: 4
yes, I think so... the ./configure-command works without problems...


 Profile  
 
 Post subject: Re: cmake failed
PostPosted: 15 Oct 2018, 16:42 
Offline

Joined: 15 Oct 2018, 08:43
Posts: 4
Hey again...

ok, there was a dependency missing... O_O thx for the hint :-)

All Ubuntu-requirements can be found here:

https://wiki.navit-project.org/index.ph ... pendencies

Thx & YS
BL


 Profile  
 
 Post subject: Re: cmake failed
PostPosted: 15 Oct 2018, 20:56 
Offline

Joined: 26 Sep 2013, 10:59
Posts: 74
What I make:
1. Install navit from Ubuntu repositories global. So all libraries installed.
2. Download tar.gz und then only make, make install (only local installation)

Ah ok, I didnt see your answer.


 Profile  
 
 Post subject: Re: cmake failed
PostPosted: 16 Oct 2018, 17:05 
Offline

Joined: 15 Oct 2018, 08:43
Posts: 4
There is only an old version in the Ubuntu repository.


 Profile  
 
 Post subject: Re: cmake failed
PostPosted: 16 Oct 2018, 18:15 
Offline

Joined: 26 Sep 2013, 10:59
Posts: 74
Yes, but I used it to install the libraries


 Profile  
 
Display posts from previous:  Sort by  
Post new topic Reply to topic  [ 7 posts ] 

All times are UTC


Who is online

Users browsing this forum: No registered users and 2 guests


You cannot post new topics in this forum
You cannot reply to topics in this forum
You cannot edit your posts in this forum
You cannot delete your posts in this forum
You cannot post attachments in this forum

Search for:
Jump to:  
cron
Powered by phpBB © 2000, 2002, 2005, 2007 phpBB Group
Silver Orange 2.0.6 for IPB Designed by Skins and Hosting
Converted for phpBB3, based on Royal Blue template by BigB © 2007 2008 AEON KINGS